AgencyCode,ClientID,ClientRef,Consent,Firstname,Surname,DOB,Gender,Ethnicity,Nationality,ClientDied,InterventionID,InterventionDate,InterventionCategory,InterventionType,AssessID,AssessDate,InitialSubstance,ReferralSource,KeyWorker,SexualOrientation,ReligionBelief,Disability,LAC,CAF,PostcodeOut,PostcodeIn,LSOAcode,MSOAcode,DATcode,LAcode,GPcode,AccomNeed,EmployStat,ParentalStat,Children,Pregnant,Substance1,Substance2,Substance3,DrinkDays,DrinkUnits,DrinkAudit,InjectingStatus,AgeFirstInjected,ShareNeedles,DualDiagnosis,ScreeningID,ScreeningDate,VaccHepAtext,VaccHepAdate,VaccHepBtext,VaccHepBdate,ScreenHepAdate,ScreenHepBdate,ScreenHepCdate,ScreenHIVdate,ScreenPCRdate,SalivaTestdate,BBVTest,BBVTestdate,WellbeingID,WellbeingDate,WellbeingQ1,WellbeingQ2,WellbeingQ3,WellbeingQ4,WellbeingQ5,WellbeingQ6,WellbeingQ7,ReferralID,ReferralDate,ReferralInOut,ReferralCategory,ReferralType,ReferralOutcome,TransactionID,TransactionDate,Insulin1ml,Barrel1ml,Barrel2ml,Barrel5ml,Barrel10ml,Barrel20ml,Yellow1/2,Orange5/8,Orange1in,Blue1in,Blue1_1/4,Green1_1/2,Citric,Stericup,Water,VitC,Filters,AlcoholWipes,Foil,Condoms,Lube,SharpsBinType,SharpsBinNumber,ReturnBinType,ReturnBinNumber,ReturnBinFullHalf,ReturnBarrels,ReturnNeedles
XXX0003,1,M9872,Y,M,W,18/11/1972 00:00,M,White British,UNITED KINGDOM,0,1,07/03/2011 00:00,Brief Intervention,Harm Reduction,,,,,,,,,,,,,,,,,,,,,,,,,,,,,,,,,,,,,,,,,,,,,,,,,,,,,,,,,,,,,,,,,,,,,,,,,,,,,,,,,,,,,,,,,,,
XXX0003,1,M9872,Y,M,W,18/11/1972 00:00,M,White British,UNITED KINGDOM,0,2,21/03/2012 00:00,Advice and Information (General),Outreach - General,,,,,,,,,,,,,,,,,,,,,,,,,,,,,,,,,,,,,,,,,,,,,,,,,,,,,,,,,,,,,,,,,,,,,,,,,,,,,,,,,,,,,,,,,,,
XXX0003,1,M9872,Y,M,W,18/11/1972 00:00,M,White British,UNITED KINGDOM,0,3,22/03/2012 00:00,Brief Intervention,Rehab,,,,,,,,,,,,,,,,,,,,,,,,,,,,,,,,,,,,,,,,,,,,,,,,,,,,,,,,,,,,,,,,,,,,,,,,,,,,,,,,,,,,,,,,,,,
XXX0003,2,A2323,Y,H,R,09/02/1973 00:00,M,White British,IRELAND,0,4,07/03/2012 00:00,Brief Intervention,Education,,,,,,,,,,,,,,,,,,,,,,,,,,,,,,,,,,,,,,,,,,,,,,,,,,,,,,,,,,,,,,,,,,,,,,,,,,,,,,,,,,,,,,,,,,,
XXX0003,3,YZ741,Y,J,B,04/03/1987 00:00,M,White and Asian,UNITED KINGDOM,0,5,06/06/2012 00:00,Brief Intervention,Education,,,,,,,,,,,,,,,,,,,,,,,,,,,,,,,,,,,,,,,,,,,,,,,,,,,,,,,,,,,,,,,,,,,,,,,,,,,,,,,,,,,,,,,,,,,
XXX0003,3,YZ741,Y,J,B,04/03/1987 00:00,M,White and Asian,UNITED KINGDOM,0,6,12/06/2012 00:00,Brief Intervention,Education,,,,,,,,,,,,,,,,,,,,,,,,,,,,,,,,,,,,,,,,,,,,,,,,,,,,,,,,,,,,,,,,,,,,,,,,,,,,,,,,,,,,,,,,,,,
XXX0003,3,YZ741,Y,J,B,04/03/1987 00:00,M,White and Asian,UNITED KINGDOM,0,7,13/06/2012 00:00,Brief Intervention,Harm Reduction,,,,,,,,,,,,,,,,,,,,,,,,,,,,,,,,,,,,,,,,,,,,,,,,,,,,,,,,,,,,,,,,,,,,,,,,,,,,,,,,,,,,,,,,,,,
XXX0003,3,YZ741,Y,J,B,04/03/1987 00:00,M,White and Asian,UNITED KINGDOM,0,8,24/05/2012 00:00,Brief Intervention,Education,,,,,,,,,,,,,,,,,,,,,,,,,,,,,,,,,,,,,,,,,,,,,,,,,,,,,,,,,,,,,,,,,,,,,,,,,,,,,,,,,,,,,,,,,,,
XXX0003,2,A2323,Y,H,R,09/02/1973 00:00,M,White British,IRELAND,0,9,11/04/2012 00:00,Brief Intervention,Outreach - General,,,,,,,,,,,,,,,,,,,,,,,,,,,,,,,,,,,,,,,,,,,,,,,,,,,,,,,,,,,,,,,,,,,,,,,,,,,,,,,,,,,,,,,,,,,
XXX0003,2,A2323,Y,H,R,09/02/1973 00:00,M,White British,IRELAND,0,10,16/05/2012 00:00,Advice and Information (General),Outreach - General,,,,,,,,,,,,,,,,,,,,,,,,,,,,,,,,,,,,,,,,,,,,,,,,,,,,,,,,,,,,,,,,,,,,,,,,,,,,,,,,,,,,,,,,,,,
XXX0003,2,A2323,Y,H,R,09/02/1973 00:00,M,White British,IRELAND,0,11,23/05/2012 00:00,Advice and Information (General),Harm Reduction,,,,,,,,,,,,,,,,,,,,,,,,,,,,,,,,,,,,,,,,,,,,,,,,,,,,,,,,,,,,,,,,,,,,,,,,,,,,,,,,,,,,,,,,,,,
XXX0003,4,DF1287,Y,D,B,05/03/1981 00:00,M,White British,UNITED KINGDOM,0,12,02/05/2013 00:00,Advice and Information (General),Detox,,,,,,,,,,,,,,,,,,,,,,,,,,,,,,,,,,,,,,,,,,,,,,,,,,,,,,,,,,,,,,,,,,,,,,,,,,,,,,,,,,,,,,,,,,,
XXX0003,4,DF1287,Y,D,B,05/03/1981 00:00,M,White British,UNITED KINGDOM,0,13,08/05/2013 00:00,Advice and Information (General),Education,,,,,,,,,,,,,,,,,,,,,,,,,,,,,,,,,,,,,,,,,,,,,,,,,,,,,,,,,,,,,,,,,,,,,,,,,,,,,,,,,,,,,,,,,,,
XXX0003,5,WI987,Y,A,B,04/03/1975 00:00,F,Other,AMERICAN SAMOA,0,14,27/02/2013 00:00,Brief Intervention,Detox,,,,,,,,,,,,,,,,,,,,,,,,,,,,,,,,,,,,,,,,,,,,,,,,,,,,,,,,,,,,,,,,,,,,,,,,,,,,,,,,,,,,,,,,,,,
XXX0003,5,WI987,Y,A,B,04/03/1975 00:00,F,Other,AMERICAN SAMOA,0,15,02/05/2013 00:00,Advice and Information (General),Education,,,,,,,,,,,,,,,,,,,,,,,,,,,,,,,,,,,,,,,,,,,,,,,,,,,,,,,,,,,,,,,,,,,,,,,,,,,,,,,,,,,,,,,,,,,
XXX0003,5,WI987,Y,A,B,04/03/1975 00:00,F,Other,AMERICAN SAMOA,0,16,14/05/2013 00:00,Brief Intervention,Detox,,,,,,,,,,,,,,,,,,,,,,,,,,,,,,,,,,,,,,,,,,,,,,,,,,,,,,,,,,,,,,,,,,,,,,,,,,,,,,,,,,,,,,,,,,,
XXX0003,6,A2424,Y,J,C,05/09/1985 00:00,M,Chinese,UNITED KINGDOM,0,17,17/04/2013 00:00,Advice and Information (General),Education,,,,,,,,,,,,,,,,,,,,,,,,,,,,,,,,,,,,,,,,,,,,,,,,,,,,,,,,,,,,,,,,,,,,,,,,,,,,,,,,,,,,,,,,,,,
XXX0003,6,A2424,Y,J,C,05/09/1985 00:00,M,Chinese,UNITED KINGDOM,0,18,02/05/2013 00:00,Advice and Information (General),Harm Reduction,,,,,,,,,,,,,,,,,,,,,,,,,,,,,,,,,,,,,,,,,,,,,,,,,,,,,,,,,,,,,,,,,,,,,,,,,,,,,,,,,,,,,,,,,,,
XXX0003,6,A2424,Y,J,C,05/09/1985 00:00,M,Chinese,UNITED KINGDOM,0,19,08/05/2013 00:00,Brief Intervention,Outreach - General,,,,,,,,,,,,,,,,,,,,,,,,,,,,,,,,,,,,,,,,,,,,,,,,,,,,,,,,,,,,,,,,,,,,,,,,,,,,,,,,,,,,,,,,,,,
XXX0003,6,A2424,Y,J,C,05/09/1985 00:00,M,Chinese,UNITED KINGDOM,0,20,10/05/2013 00:00,Brief Intervention,Outreach - General,,,,,,,,,,,,,,,,,,,,,,,,,,,,,,,,,,,,,,,,,,,,,,,,,,,,,,,,,,,,,,,,,,,,,,,,,,,,,,,,,,,,,,,,,,,
XXX0003,6,A2424,Y,J,C,05/09/1985 00:00,M,Chinese,UNITED KINGDOM,0,21,20/05/2013 00:00,Brief Intervention,Detox,,,,,,,,,,,,,,,,,,,,,,,,,,,,,,,,,,,,,,,,,,,,,,,,,,,,,,,,,,,,,,,,,,,,,,,,,,,,,,,,,,,,,,,,,,,
XXX0003,7,TS852,Y,M,C,04/03/1997 00:00,M,White British,UNITED KINGDOM,0,22,01/03/2013 00:00,Advice and Information (General),Education,,,,,,,,,,,,,,,,,,,,,,,,,,,,,,,,,,,,,,,,,,,,,,,,,,,,,,,,,,,,,,,,,,,,,,,,,,,,,,,,,,,,,,,,,,,
XXX0003,7,TS852,Y,M,C,04/03/1997 00:00,M,White British,UNITED KINGDOM,0,23,03/04/2013 00:00,Brief Intervention,Education,,,,,,,,,,,,,,,,,,,,,,,,,,,,,,,,,,,,,,,,,,,,,,,,,,,,,,,,,,,,,,,,,,,,,,,,,,,,,,,,,,,,,,,,,,,
XXX0003,7,TS852,Y,M,C,04/03/1997 00:00,M,White British,UNITED KINGDOM,0,24,16/05/2013 00:00,Advice and Information (General),Outreach - General,,,,,,,,,,,,,,,,,,,,,,,,,,,,,,,,,,,,,,,,,,,,,,,,,,,,,,,,,,,,,,,,,,,,,,,,,,,,,,,,,,,,,,,,,,,
XXX0003,1,M9872,Y,M,W,18/11/1972 00:00,M,White British,UNITED KINGDOM,0,25,20/11/2013 00:00,Brief Intervention,Sexual health contact,,,,,,,,,,,,,,,,,,,,,,,,,,,,,,,,,,,,,,,,,,,,,,,,,,,,,,,,,,,,,,,,,,,,,,,,,,,,,,,,,,,,,,,,,,,
XXX0003,1,M9872,Y,M,W,18/11/1972 00:00,M,White British,UNITED KINGDOM,0,26,20/11/2013 00:00,Brief Intervention,Anabolic Steroid Contact,,,,,,,,,,,,,,,,,,,,,,,,,,,,,,,,,,,,,,,,,,,,,,,,,,,,,,,,,,,,,,,,,,,,,,,,,,,,,,,,,,,,,,,,,,,
XXX0003,3,YZ741,Y,J,B,04/03/1987 00:00,M,White and Asian,UNITED KINGDOM,0,28,01/03/2013 00:00,Brief Intervention,Alcohol Drop in,,,,,,,,,,,,,,,,,,,,,,,,,,,,,,,,,,,,,,,,,,,,,,,,,,,,,,,,,,,,,,,,,,,,,,,,,,,,,,,,,,,,,,,,,,,
XXX0003,5,WI987,Y,A,B,04/03/1975 00:00,F,Other,AMERICAN SAMOA,0,29,28/04/2014 00:00,Brief Intervention,Safer Drug Use,,,,,,,,,,,,,,,,,,,,,,,,,,,,,,,,,,,,,,,,,,,,,,,,,,,,,,,,,,,,,,,,,,,,,,,,,,,,,,,,,,,,,,,,,,,
XXX0003,4,DF1287,Y,D,B,05/03/1981 00:00,M,White British,UNITED KINGDOM,0,30,16/05/2014 00:00,Advice and Information (General),Alcohol Drop in,,,,,,,,,,,,,,,,,,,,,,,,,,,,,,,,,,,,,,,,,,,,,,,,,,,,,,,,,,,,,,,,,,,,,,,,,,,,,,,,,,,,,,,,,,,
XXX0003,1,M9872,Y,M,W,18/11/1972 00:00,M,White British,UNITED KINGDOM,0,,,,,1,17/03/2011 00:00,1101,,,,,,,,L18,8AL,E01006525,E02001395,B17B,E08000012,N82076,NFA - urgent housing problem,Pupil / Student,Some of the children under 18 live with client,,0,2200,3100,5000,12,20,34,Currently,,,0,,,,,,,,,,,,,,,,,,,,,,,,,,,,,,,,,,,,,,,,,,,,,,,,,,,,,,,,,,,
XXX0003,1,M9872,Y,M,W,18/11/1972 00:00,M,White British,UNITED KINGDOM,0,,,,,2,11/04/2013 00:00,1101,,,,,,,,L18,8AL,E01006525,E02001395,B17B,E08000012,N82076,NFA - urgent housing problem,Homemaker,None of the children under 18 live with client,,0,7000,7000,3406,23,2,34,Previously,,,0,,,,,,,,,,,,,,,,,,,,,,,,,,,,,,,,,,,,,,,,,,,,,,,,,,,,,,,,,,,
XXX0003,3,YZ741,Y,J,B,04/03/1987 00:00,M,White and Asian,UNITED KINGDOM,0,,,,,3,06/06/2012 00:00,1101,,,,,,,,L1,4HF,E01033761,E02006932,B17B,E08000012,,Housing problem,Regular Employment,All of the children under 18 live with client,,0,1101,7000,3201,13,10,18,Previously,,,0,,,,,,,,,,,,,,,,,,,,,,,,,,,,,,,,,,,,,,,,,,,,,,,,,,,,,,,,,,,
XXX0003,2,A2323,Y,H,R,09/02/1973 00:00,M,White British,IRELAND,0,,,,,4,16/05/2012 00:00,2201,,,,,,,,L17,7BE,,,B17B,E08000012,N82004,Housing problem,Pupil / Student,None of the children under 18 live with client,,0,2200,8799,3200,28,13,24,Previously,,,0,,,,,,,,,,,,,,,,,,,,,,,,,,,,,,,,,,,,,,,,,,,,,,,,,,,,,,,,,,,
XXX0003,2,A2323,Y,H,R,09/02/1973 00:00,M,White British,IRELAND,0,,,,,5,15/08/2011 00:00,2201,,,,,,,,L18,8AL,E01006525,E02001395,B17B,E08000012,N82004,No housing problem,Long term sick or disabled,Not a parent of children under 18,,0,1101,3201,3406,14,14,22,Previously,,,0,,,,,,,,,,,,,,,,,,,,,,,,,,,,,,,,,,,,,,,,,,,,,,,,,,,,,,,,,,,
XXX0003,3,YZ741,Y,J,B,04/03/1987 00:00,M,White and Asian,UNITED KINGDOM,0,,,,,9,01/03/2013 00:00,1101,,,,,,,,M13,0TW,,,B18B,E08000014,,NFA - urgent housing problem,Long term sick or disabled,Some of the children under 18 live with client,,0,7000,3201,3406,13,23,34,Currently,,,0,,,,,,,,,,,,,,,,,,,,,,,,,,,,,,,,,,,,,,,,,,,,,,,,,,,,,,,,,,,
XXX0003,4,DF1287,Y,D,B,05/03/1981 00:00,M,White British,UNITED KINGDOM,0,,,,,10,02/05/2013 00:00,1101,,,,,,,,L18,8AL,E01006525,E02001395,B17B,E08000012,N82001,Housing problem,Regular Employment,All of the children under 18 live with client,,0,7001,3201,3200,13,28,,Currently,,,0,,,,,,,,,,,,,,,,,,,,,,,,,,,,,,,,,,,,,,,,,,,,,,,,,,,,,,,,,,,
XXX0003,5,WI987,Y,A,B,04/03/1975 00:00,F,Other,AMERICAN SAMOA,0,,,,,11,04/04/2013 00:00,7000,,,,,,,,CH45,1LJ,,,B06B,E06000049 ,,NFA - urgent housing problem,Pupil / Student,Some of the children under 18 live with client,,0,5000,2200,3201,,,,Currently,,,0,,,,,,,,,,,,,,,,,,,,,,,,,,,,,,,,,,,,,,,,,,,,,,,,,,,,,,,,,,,
XXX0003,6,A2424,Y,J,C,05/09/1985 00:00,M,Chinese,UNITED KINGDOM,0,,,,,12,09/05/2013 00:00,1401,,,,,,,,CH63,3EU,,,B06B,E06000049 ,,Housing problem,Long term sick or disabled,Some of the children under 18 live with client,,0,3100,9996,9997,13,4,,Previously,,,0,,,,,,,,,,,,,,,,,,,,,,,,,,,,,,,,,,,,,,,,,,,,,,,,,,,,,,,,,,,
XXX0003,7,TS852,Y,M,C,04/03/1997 00:00,M,White British,UNITED KINGDOM,0,,,,,13,21/05/2013 00:00,3100,,,,,,,,L1,4HF,E01033761,E02006932,B17B,E08000012,N82003,Housing problem,Pupil / Student,Some of the children under 18 live with client,,0,3100,3100,3100,14,2,12,Previously,,,0,,,,,,,,,,,,,,,,,,,,,,,,,,,,,,,,,,,,,,,,,,,,,,,,,,,,,,,,,,,
XXX0003,2,A2323,Y,H,R,09/02/1973 00:00,M,White British,IRELAND,0,,,,,14,19/11/2013 00:00,2201,,,,,,,,L17,7BE,,,B17B,E08000012,N82004,Housing problem,Pupil / Student,None of the children under 18 live with client,,0,2201,7000,9997,10,15,20,Never,,,0,,,,,,,,,,,,,,,,,,,,,,,,,,,,,,,,,,,,,,,,,,,,,,,,,,,,,,,,,,,
XXX0003,1,M9872,Y,M,W,18/11/1972 00:00,M,White British,UNITED KINGDOM,0,,,,,16,19/11/2013 00:00,1101,,,,,,,,L18,8AL,,,B17B,E08000012,N82076,No housing problem,Regular Employment,None of the children under 18 live with client,,0,1101,5000,7000,,,,Currently,,,0,,,,,,,,,,,,,,,,,,,,,,,,,,,,,,,,,,,,,,,,,,,,,,,,,,,,,,,,,,,
XXX0003,8,B1123,Y,S,B,15/04/1979 00:00,M,White British,UNITED KINGDOM,0,,,,,17,02/12/2013 00:00,7000,,,,,,,,L3,2ET,,,B17B,E08000012,,Housing problem,Regular Employment,Not a parent of children under 18,,0,3100,3200,9997,10,7,20,Never,,,0,,,,,,,,,,,,,,,,,,,,,,,,,,,,,,,,,,,,,,,,,,,,,,,,,,,,,,,,,,,
XXX0003,9,ABC95,Y,J,S,01/01/1981 00:00,M,White British,UNITED KINGDOM,0,,,,,18,03/02/2014 00:00,7000,,,,,,,,L3,2ET,,,B17B,E08000012,,No housing problem,Regular Employment,Not a parent of children under 18,,0,7000,5000,9997,7,20,25,Never,,,0,,,,,,,,,,,,,,,,,,,,,,,,,,,,,,,,,,,,,,,,,,,,,,,,,,,,,,,,,,,
XXX0003,4,DF1287,Y,D,B,05/03/1981 00:00,M,White British,UNITED KINGDOM,0,,,,,19,27/06/2014 00:00,1101,,,,,,,,L7,8RX,,,B17B,E08000012,N82001,NFA - urgent housing problem,Pupil / Student,All of the children under 18 live with client,,0,7000,7000,7000,,,,Currently,,,0,,,,,,,,,,,,,,,,,,,,,,,,,,,,,,,,,,,,,,,,,,,,,,,,,,,,,,,,,,,
XXX0003,2,A2323,Y,H,R,09/02/1973 00:00,M,White British,IRELAND,0,,,,,,,,,,,,,,,,,,,,,,,,,,,,,,,,,,,,,1,26/11/2013 00:00,,,,,,26/11/2013 00:00,26/11/2013 00:00,26/11/2013 00:00,,,,,,,,,,,,,,,,,,,,,,,,,,,,,,,,,,,,,,,,,,,,,,,,,
XXX0003,8,B1123,Y,S,B,15/04/1979 00:00,M,White British,UNITED KINGDOM,0,,,,,,,,,,,,,,,,,,,,,,,,,,,,,,,,,,,,,2,02/12/2013 00:00,1 vaccination,02/12/2013 00:00,1 vaccination,02/12/2013 00:00,02/12/2013 00:00,02/12/2013 00:00,02/12/2013 00:00,02/12/2013 00:00,02/12/2013 00:00,02/12/2013 00:00,Already immunised,,,,,,,,,,,,,,,,,,,,,,,,,,,,,,,,,,,,,,,,,,,,,,
XXX0003,4,DF1287,Y,D,B,05/03/1981 00:00,M,White British,UNITED KINGDOM,0,,,,,,,,,,,,,,,,,,,,,,,,,,,,,,,,,,,,,3,12/06/2014 00:00,,,,,,12/06/2014 00:00,,,,24/06/2014 00:00,,,,,,,,,,,,,,,,,,,,,,,,,,,,,,,,,,,,,,,,,,,,,,,
XXX0003,4,DF1287,Y,D,B,05/03/1981 00:00,M,White British,UNITED KINGDOM,0,,,,,,,,,,,,,,,,,,,,,,,,,,,,,,,,,,,,,4,23/06/2014 00:00,1 vaccination,23/06/2014 00:00,,,23/06/2014 00:00,,,,23/06/2014 00:00,,,,,,,,,,,,,,,,,,,,,,,,,,,,,,,,,,,,,,,,,,,,,,,,
XXX0003,4,DF1287,Y,D,B,05/03/1981 00:00,M,White British,UNITED KINGDOM,0,,,,,,,,,,,,,,,,,,,,,,,,,,,,,,,,,,,,,5,27/06/2014 00:00,,,,,27/06/2014 00:00,,,27/06/2014 00:00,,,,,,,,,,,,,,,,,,,,,,,,,,,,,,,,,,,,,,,,,,,,,,,,,
XXX0003,4,DF1287,Y,D,B,05/03/1981 00:00,M,White British,UNITED KINGDOM,0,,,,,,,,,,,,,,,,,,,,,,,,,,,,,,,,,,,,,6,27/06/2014 00:00,,,,,27/06/2014 00:00,27/06/2014 00:00,27/06/2014 00:00,27/06/2014 00:00,27/06/2014 00:00,,,,,,,,,,,,,,,,,,,,,,,,,,,,,,,,,,,,,,,,,,,,,,,,
XXX0003,4,DF1287,Y,D,B,05/03/1981 00:00,M,White British,UNITED KINGDOM,0,,,,,,,,,,,,,,,,,,,,,,,,,,,,,,,,,,,,,7,02/06/2014 00:00,,,,,,,,,02/06/2014 00:00,,,,,,,,,,,,,,,,,,,,,,,,,,,,,,,,,,,,,,,,,,,,,,,,
XXX0003,1,M9872,Y,M,W,18/11/1972 00:00,M,White British,UNITED KINGDOM,0,,,,,,,,,,,,,,,,,,,,,,,,,,,,,,,,,,,,,,,,,,,,,,,,,,,1,17/03/2011 00:00,2,2,4,3,2,2,1,,,,,,,,,,,,,,,,,,,,,,,,,,,,,,,,,,,,
XXX0003,1,M9872,Y,M,W,18/11/1972 00:00,M,White British,UNITED KINGDOM,0,,,,,,,,,,,,,,,,,,,,,,,,,,,,,,,,,,,,,,,,,,,,,,,,,,,2,11/04/2013 00:00,1,2,2,2,2,1,2,,,,,,,,,,,,,,,,,,,,,,,,,,,,,,,,,,,,
XXX0003,3,YZ741,Y,J,B,04/03/1987 00:00,M,White and Asian,UNITED KINGDOM,0,,,,,,,,,,,,,,,,,,,,,,,,,,,,,,,,,,,,,,,,,,,,,,,,,,,3,06/06/2012 00:00,2,2,4,3,2,2,1,,,,,,,,,,,,,,,,,,,,,,,,,,,,,,,,,,,,
XXX0003,2,A2323,Y,H,R,09/02/1973 00:00,M,White British,IRELAND,0,,,,,,,,,,,,,,,,,,,,,,,,,,,,,,,,,,,,,,,,,,,,,,,,,,,4,16/05/2012 00:00,1,2,2,2,2,1,2,,,,,,,,,,,,,,,,,,,,,,,,,,,,,,,,,,,,
XXX0003,2,A2323,Y,H,R,09/02/1973 00:00,M,White British,IRELAND,0,,,,,,,,,,,,,,,,,,,,,,,,,,,,,,,,,,,,,,,,,,,,,,,,,,,5,15/08/2011 00:00,2,2,4,3,2,2,1,,,,,,,,,,,,,,,,,,,,,,,,,,,,,,,,,,,,
XXX0003,3,YZ741,Y,J,B,04/03/1987 00:00,M,White and Asian,UNITED KINGDOM,0,,,,,,,,,,,,,,,,,,,,,,,,,,,,,,,,,,,,,,,,,,,,,,,,,,,9,01/03/2013 00:00,1,2,2,2,2,1,2,,,,,,,,,,,,,,,,,,,,,,,,,,,,,,,,,,,,
XXX0003,4,DF1287,Y,D,B,05/03/1981 00:00,M,White British,UNITED KINGDOM,0,,,,,,,,,,,,,,,,,,,,,,,,,,,,,,,,,,,,,,,,,,,,,,,,,,,10,02/05/2013 00:00,2,2,4,3,2,2,1,,,,,,,,,,,,,,,,,,,,,,,,,,,,,,,,,,,,
XXX0003,5,WI987,Y,A,B,04/03/1975 00:00,F,Other,AMERICAN SAMOA,0,,,,,,,,,,,,,,,,,,,,,,,,,,,,,,,,,,,,,,,,,,,,,,,,,,,11,04/04/2013 00:00,1,2,2,2,2,1,2,,,,,,,,,,,,,,,,,,,,,,,,,,,,,,,,,,,,
XXX0003,6,A2424,Y,J,C,05/09/1985 00:00,M,Chinese,UNITED KINGDOM,0,,,,,,,,,,,,,,,,,,,,,,,,,,,,,,,,,,,,,,,,,,,,,,,,,,,12,09/05/2013 00:00,2,2,3,2,2,4,2,,,,,,,,,,,,,,,,,,,,,,,,,,,,,,,,,,,,
XXX0003,7,TS852,Y,M,C,04/03/1997 00:00,M,White British,UNITED KINGDOM,0,,,,,,,,,,,,,,,,,,,,,,,,,,,,,,,,,,,,,,,,,,,,,,,,,,,13,21/05/2013 00:00,2,2,3,2,2,2,2,,,,,,,,,,,,,,,,,,,,,,,,,,,,,,,,,,,,
XXX0003,2,A2323,Y,H,R,09/02/1973 00:00,M,White British,IRELAND,0,,,,,,,,,,,,,,,,,,,,,,,,,,,,,,,,,,,,,,,,,,,,,,,,,,,14,19/11/2013 00:00,2,2,4,3,2,2,1,,,,,,,,,,,,,,,,,,,,,,,,,,,,,,,,,,,,
XXX0003,1,M9872,Y,M,W,18/11/1972 00:00,M,White British,UNITED KINGDOM,0,,,,,,,,,,,,,,,,,,,,,,,,,,,,,,,,,,,,,,,,,,,,,,,,,,,16,19/11/2013 00:00,1,2,2,2,2,1,2,,,,,,,,,,,,,,,,,,,,,,,,,,,,,,,,,,,,
XXX0003,8,B1123,Y,S,B,15/04/1979 00:00,M,White British,UNITED KINGDOM,0,,,,,,,,,,,,,,,,,,,,,,,,,,,,,,,,,,,,,,,,,,,,,,,,,,,17,02/12/2013 00:00,1,1,1,1,3,1,3,,,,,,,,,,,,,,,,,,,,,,,,,,,,,,,,,,,,
XXX0003,9,ABC95,Y,J,S,01/01/1981 00:00,M,White British,UNITED KINGDOM,0,,,,,,,,,,,,,,,,,,,,,,,,,,,,,,,,,,,,,,,,,,,,,,,,,,,18,03/02/2014 00:00,3,3,4,3,3,2,3,,,,,,,,,,,,,,,,,,,,,,,,,,,,,,,,,,,,
XXX0003,4,DF1287,Y,D,B,05/03/1981 00:00,M,White British,UNITED KINGDOM,0,,,,,,,,,,,,,,,,,,,,,,,,,,,,,,,,,,,,,,,,,,,,,,,,,,,19,27/06/2014 00:00,1,1,1,1,1,1,5,,,,,,,,,,,,,,,,,,,,,,,,,,,,,,,,,,,,
XXX0003,1,M9872,Y,M,W,18/11/1972 00:00,M,White British,UNITED KINGDOM,0,,,,,,,,,,,,,,,,,,,,,,,,,,,,,,,,,,,,,,,,,,,,,,,,,,,,,,,,,,,,1,15/03/2012 00:00,Out,Drug service non-Statutory,SHARP,,,,,,,,,,,,,,,,,,,,,,,,,,,,,,,
XXX0003,1,M9872,Y,M,W,18/11/1972 00:00,M,White British,UNITED KINGDOM,0,,,,,,,,,,,,,,,,,,,,,,,,,,,,,,,,,,,,,,,,,,,,,,,,,,,,,,,,,,,,2,17/03/2012 00:00,In,Drug Service Statutory,SHARP,,,,,,,,,,,,,,,,,,,,,,,,,,,,,,,
XXX0003,1,M9872,Y,M,W,18/11/1972 00:00,M,White British,UNITED KINGDOM,0,,,,,,,,,,,,,,,,,,,,,,,,,,,,,,,,,,,,,,,,,,,,,,,,,,,,,,,,,,,,3,22/03/2012 00:00,Out,Other,Whitechapel,,,,,,,,,,,,,,,,,,,,,,,,,,,,,,,
XXX0003,2,A2323,Y,H,R,09/02/1973 00:00,M,White British,IRELAND,0,,,,,,,,,,,,,,,,,,,,,,,,,,,,,,,,,,,,,,,,,,,,,,,,,,,,,,,,,,,,4,15/03/2012 00:00,Out,Police Service (including specialist rape),SHARP,,,,,,,,,,,,,,,,,,,,,,,,,,,,,,,
XXX0003,3,YZ741,Y,J,B,04/03/1987 00:00,M,White and Asian,UNITED KINGDOM,0,,,,,,,,,,,,,,,,,,,,,,,,,,,,,,,,,,,,,,,,,,,,,,,,,,,,,,,,,,,,5,07/06/2012 00:00,Out,Drug Service Statutory,Liverpool DDU,,,,,,,,,,,,,,,,,,,,,,,,,,,,,,,
XXX0003,3,YZ741,Y,J,B,04/03/1987 00:00,M,White and Asian,UNITED KINGDOM,0,,,,,,,,,,,,,,,,,,,,,,,,,,,,,,,,,,,,,,,,,,,,,,,,,,,,,,,,,,,,6,13/06/2012 00:00,Out,Other,Addaction Outreach,,,,,,,,,,,,,,,,,,,,,,,,,,,,,,,
XXX0003,3,YZ741,Y,J,B,04/03/1987 00:00,M,White and Asian,UNITED KINGDOM,0,,,,,,,,,,,,,,,,,,,,,,,,,,,,,,,,,,,,,,,,,,,,,,,,,,,,,,,,,,,,7,03/08/2012 00:00,Out,Other,Armistead Street,,,,,,,,,,,,,,,,,,,,,,,,,,,,,,,
XXX0003,3,YZ741,Y,J,B,04/03/1987 00:00,M,White and Asian,UNITED KINGDOM,0,,,,,,,,,,,,,,,,,,,,,,,,,,,,,,,,,,,,,,,,,,,,,,,,,,,,,,,,,,,,8,15/08/2012 00:00,Out,Drug Service Statutory,Armistead Street,,,,,,,,,,,,,,,,,,,,,,,,,,,,,,,
XXX0003,3,YZ741,Y,J,B,04/03/1987 00:00,M,White and Asian,UNITED KINGDOM,0,,,,,,,,,,,,,,,,,,,,,,,,,,,,,,,,,,,,,,,,,,,,,,,,,,,,,,,,,,,,9,16/08/2012 00:00,Out,Other,Whitechapel,,,,,,,,,,,,,,,,,,,,,,,,,,,,,,,
XXX0003,3,YZ741,Y,J,B,04/03/1987 00:00,M,White and Asian,UNITED KINGDOM,0,,,,,,,,,,,,,,,,,,,,,,,,,,,,,,,,,,,,,,,,,,,,,,,,,,,,,,,,,,,,10,02/08/2012 00:00,Out,GP,Dare to Care,,,,,,,,,,,,,,,,,,,,,,,,,,,,,,,
XXX0003,3,YZ741,Y,J,B,04/03/1987 00:00,M,White and Asian,UNITED KINGDOM,0,,,,,,,,,,,,,,,,,,,,,,,,,,,,,,,,,,,,,,,,,,,,,,,,,,,,,,,,,,,,11,11/08/2012 00:00,Out,Drug Service Statutory,SHARP,,,,,,,,,,,,,,,,,,,,,,,,,,,,,,,
XXX0003,3,YZ741,Y,J,B,04/03/1987 00:00,M,White and Asian,UNITED KINGDOM,0,,,,,,,,,,,,,,,,,,,,,,,,,,,,,,,,,,,,,,,,,,,,,,,,,,,,,,,,,,,,12,17/08/2012 00:00,Out,Drug Service Statutory,Pharmacy Needle Exchange,,,,,,,,,,,,,,,,,,,,,,,,,,,,,,,
XXX0003,4,DF1287,Y,D,B,05/03/1981 00:00,M,White British,UNITED KINGDOM,0,,,,,,,,,,,,,,,,,,,,,,,,,,,,,,,,,,,,,,,,,,,,,,,,,,,,,,,,,,,,14,02/05/2013 00:00,Out,Psychiatry services,Armistead City,,,,,,,,,,,,,,,,,,,,,,,,,,,,,,,
XXX0003,4,DF1287,Y,D,B,05/03/1981 00:00,M,White British,UNITED KINGDOM,0,,,,,,,,,,,,,,,,,,,,,,,,,,,,,,,,,,,,,,,,,,,,,,,,,,,,,,,,,,,,15,09/05/2013 00:00,Out,Other,Dare to Care,,,,,,,,,,,,,,,,,,,,,,,,,,,,,,,
XXX0003,5,WI987,Y,A,B,04/03/1975 00:00,F,Other,AMERICAN SAMOA,0,,,,,,,,,,,,,,,,,,,,,,,,,,,,,,,,,,,,,,,,,,,,,,,,,,,,,,,,,,,,16,02/05/2013 00:00,In,Drug Service Statutory,Armistead City,,,,,,,,,,,,,,,,,,,,,,,,,,,,,,,
XXX0003,5,WI987,Y,A,B,04/03/1975 00:00,F,Other,AMERICAN SAMOA,0,,,,,,,,,,,,,,,,,,,,,,,,,,,,,,,,,,,,,,,,,,,,,,,,,,,,,,,,,,,,17,09/05/2013 00:00,Out,Probation,Armistead Street,,,,,,,,,,,,,,,,,,,,,,,,,,,,,,,
XXX0003,5,WI987,Y,A,B,04/03/1975 00:00,F,Other,AMERICAN SAMOA,0,,,,,,,,,,,,,,,,,,,,,,,,,,,,,,,,,,,,,,,,,,,,,,,,,,,,,,,,,,,,18,10/05/2013 00:00,Out,DRR - Drug Rehabilitation Requirement,Armistead Street,,,,,,,,,,,,,,,,,,,,,,,,,,,,,,,
XXX0003,6,A2424,Y,J,C,05/09/1985 00:00,M,Chinese,UNITED KINGDOM,0,,,,,,,,,,,,,,,,,,,,,,,,,,,,,,,,,,,,,,,,,,,,,,,,,,,,,,,,,,,,19,28/02/2013 00:00,Out,Outreach,Armistead City,,,,,,,,,,,,,,,,,,,,,,,,,,,,,,,
XXX0003,6,A2424,Y,J,C,05/09/1985 00:00,M,Chinese,UNITED KINGDOM,0,,,,,,,,,,,,,,,,,,,,,,,,,,,,,,,,,,,,,,,,,,,,,,,,,,,,,,,,,,,,20,15/05/2013 00:00,Out,Other,Dare to Care,,,,,,,,,,,,,,,,,,,,,,,,,,,,,,,
XXX0003,6,A2424,Y,J,C,05/09/1985 00:00,M,Chinese,UNITED KINGDOM,0,,,,,,,,,,,,,,,,,,,,,,,,,,,,,,,,,,,,,,,,,,,,,,,,,,,,,,,,,,,,21,16/05/2013 00:00,Out,Probation,Armistead Street,,,,,,,,,,,,,,,,,,,,,,,,,,,,,,,
XXX0003,7,TS852,Y,M,C,04/03/1997 00:00,M,White British,UNITED KINGDOM,0,,,,,,,,,,,,,,,,,,,,,,,,,,,,,,,,,,,,,,,,,,,,,,,,,,,,,,,,,,,,22,04/05/2013 00:00,Out,Drug Service Statutory,Whitechapel,,,,,,,,,,,,,,,,,,,,,,,,,,,,,,,
XXX0003,7,TS852,Y,M,C,04/03/1997 00:00,M,White British,UNITED KINGDOM,0,,,,,,,,,,,,,,,,,,,,,,,,,,,,,,,,,,,,,,,,,,,,,,,,,,,,,,,,,,,,23,15/05/2013 00:00,Out,Prison/CARAT,Dare to Care,,,,,,,,,,,,,,,,,,,,,,,,,,,,,,,
XXX0003,2,A2323,Y,H,R,09/02/1973 00:00,M,White British,IRELAND,0,,,,,,,,,,,,,,,,,,,,,,,,,,,,,,,,,,,,,,,,,,,,,,,,,,,,,,,,,,,,24,29/11/2013 00:00,Out,Hospital General,,,,,,,,,,,,,,,,,,,,,,,,,,,,,,,,
XXX0003,8,B1123,Y,S,B,15/04/1979 00:00,M,White British,UNITED KINGDOM,0,,,,,,,,,,,,,,,,,,,,,,,,,,,,,,,,,,,,,,,,,,,,,,,,,,,,,,,,,,,,25,02/12/2013 00:00,In,Self,HCV nurse,,,,,,,,,,,,,,,,,,,,,,,,,,,,,,,
XXX0003,8,B1123,Y,S,B,15/04/1979 00:00,M,White British,UNITED KINGDOM,0,,,,,,,,,,,,,,,,,,,,,,,,,,,,,,,,,,,,,,,,,,,,,,,,,,,,,,,,,,,,26,02/12/2013 00:00,Out,Concerned Others,Needle Exchange Pharmacy,,,,,,,,,,,,,,,,,,,,,,,,,,,,,,,
XXX0003,9,ABC95,Y,J,S,01/01/1981 00:00,M,White British,UNITED KINGDOM,0,,,,,,,,,,,,,,,,,,,,,,,,,,,,,,,,,,,,,,,,,,,,,,,,,,,,,,,,,,,,27,03/02/2014 00:00,In,Self,,,,,,,,,,,,,,,,,,,,,,,,,,,,,,,,
XXX0003,9,ABC95,Y,J,S,01/01/1981 00:00,M,White British,UNITED KINGDOM,0,,,,,,,,,,,,,,,,,,,,,,,,,,,,,,,,,,,,,,,,,,,,,,,,,,,,,,,,,,,,28,03/02/2014 00:00,Out,Detox Service,NHS Services,,,,,,,,,,,,,,,,,,,,,,,,,,,,,,,
XXX0003,8,B1123,Y,S,B,15/04/1979 00:00,M,White British,UNITED KINGDOM,0,,,,,,,,,,,,,,,,,,,,,,,,,,,,,,,,,,,,,,,,,,,,,,,,,,,,,,,,,,,,29,09/06/2014 00:00,Out,Syringe Exchange,HCV nurse,,,,,,,,,,,,,,,,,,,,,,,,,,,,,,,
